﻿"Item Id","Item URI","Dublin Core:Title","Dublin Core:Description","Dublin Core:Subject","Dublin Core:Rights","Dublin Core:Format","Dublin Core:Type","Dublin Core:Date","Dublin Core:Source","Dublin Core:Creator","Dublin Core:Publisher","Dublin Core:Contributor","Dublin Core:Relation","Dublin Core:Language","Dublin Core:Identifier","Dublin Core:Coverage","Item Type Metadata:Text","Item Type Metadata:Transcription","Item Type Metadata:Original Format","Item Type Metadata:Physical Dimensions","Item Type Metadata:Duration","Item Type Metadata:Compression","Item Type Metadata:Producer","Item Type Metadata:Director","Item Type Metadata:Bit Rate/Frequency","Item Type Metadata:URL","Item Type Metadata:Note","Item Type Metadata:Hidden Search Text","Item Type Metadata:Rights Note",tags,file,itemType,collection,public,featured
11906,https://archives.howelllibrary.org/items/show/11906,"Steven Sanford, Michigan Army National Guard, 2006-2019",,Veterans,"Copyright Undetermined",image/jpeg,Image,2006/2019,,,,,"<a href=""https://archives.howelllibrary.org/exhibits/show/honoring-veterans-with-howell-"">Part of the Veterans Day Exhibit</a>",,,,,,photograph,,,,,,,,"Please <a href=""https://howelllibrary.org/howell-area-archives/#archives-inquiry"">submit an inquiry</a> to the archives if you want a better quality digital image or a print. Include the title of the image and reason for print/digital image with your inquiry. Archives staff will contact you regarding your inquiry.",,"Howell Carnegie District Library makes no representation that it is the owner of the copyright in any published material. It is the responsibility of the researcher to obtain permission to publish from the owner of the copyright.","army,military,national guard,veteran",https://archives.howelllibrary.org/files/original/24f376aa39d07adde0ec90b700e70163.jpg,"Still Image",Military/Veterans,1,0
11969,https://archives.howelllibrary.org/items/show/11969,"Steve Zemper,   Sp5, U.S. Army",,Veterans,"Copyright Undetermined",image/jpeg,Image,,,,,,"<a href=""https://archives.howelllibrary.org/exhibits/show/honoring-veterans-with-howell-"">Part of the Veterans Day Exhibit</a>",,,,,,photograph,,,,,,,,"Please <a href=""https://howelllibrary.org/howell-area-archives/#archives-inquiry"">submit an inquiry</a> to the archives if you want a better quality digital image or a print. Include the title of the image and reason for print/digital image with your inquiry. Archives staff will contact you regarding your inquiry.",,"Howell Carnegie District Library makes no representation that it is the owner of the copyright in any published material. It is the responsibility of the researcher to obtain permission to publish from the owner of the copyright.","army,military,veteran",https://archives.howelllibrary.org/files/original/aa558c059d9306b6eb24e8c64c92edd2.jpg,"Still Image",Military/Veterans,1,0
11950,https://archives.howelllibrary.org/items/show/11950,"Steve Westphal,  E7, USAF",,Veterans,"Copyright Undetermined",image/jpeg,Image,,,,,,"<a href=""https://archives.howelllibrary.org/exhibits/show/honoring-veterans-with-howell-"">Part of the Veterans Day Exhibit</a>",,,,,,photograph,,,,,,,,"Please <a href=""https://howelllibrary.org/howell-area-archives/#archives-inquiry"">submit an inquiry</a> to the archives if you want a better quality digital image or a print. Include the title of the image and reason for print/digital image with your inquiry. Archives staff will contact you regarding your inquiry.",,"Howell Carnegie District Library makes no representation that it is the owner of the copyright in any published material. It is the responsibility of the researcher to obtain permission to publish from the owner of the copyright.","air force,military,veteran",https://archives.howelllibrary.org/files/original/4d118df7c47f1819156f329dd0b7a230.jpg,"Still Image",Military/Veterans,1,0
11839,https://archives.howelllibrary.org/items/show/11839,"Steve Mato, US Army, WWII",,Veterans,"Copyright Undetermined",image/jpeg,Image,,,,,,"<a href=""https://archives.howelllibrary.org/exhibits/show/honoring-veterans-with-howell-"">Part of the Veterans Day Exhibit</a>",,,,,,photograph,,,,,,,,"Please <a href=""https://howelllibrary.org/howell-area-archives/#archives-inquiry"">submit an inquiry</a> to the archives if you want a better quality digital image or a print. Include the title of the image and reason for print/digital image with your inquiry. Archives staff will contact you regarding your inquiry.",,"Howell Carnegie District Library makes no representation that it is the owner of the copyright in any published material. It is the responsibility of the researcher to obtain permission to publish from the owner of the copyright.","army,military,veteran,WWII",https://archives.howelllibrary.org/files/original/db330da90ebcc63304363908be5e6cac.jpg,"Still Image",Military/Veterans,1,0
11944,https://archives.howelllibrary.org/items/show/11944,"Stanley Vines, USAF, 1956",,Veterans,"Copyright Undetermined",image/jpeg,Image,,,,,,"<a href=""https://archives.howelllibrary.org/exhibits/show/honoring-veterans-with-howell-"">Part of the Veterans Day Exhibit</a>",,,,,,photograph,,,,,,,,"Please <a href=""https://howelllibrary.org/howell-area-archives/#archives-inquiry"">submit an inquiry</a> to the archives if you want a better quality digital image or a print. Include the title of the image and reason for print/digital image with your inquiry. Archives staff will contact you regarding your inquiry.",,"Howell Carnegie District Library makes no representation that it is the owner of the copyright in any published material. It is the responsibility of the researcher to obtain permission to publish from the owner of the copyright.","air force,military,veteran",https://archives.howelllibrary.org/files/original/153a638a4a08b221de76d3cf73022f94.jpg,"Still Image",Military/Veterans,1,0
11687,https://archives.howelllibrary.org/items/show/11687,"Stanley Cooke, USMC, Persian Gulf War",,Veterans,"In Copyright",image/jpeg,Image,,,"Richard Lim",,,"<a href=""https://archives.howelllibrary.org/exhibits/show/honoring-veterans-with-howell-"">Part of the Veterans Day Exhibit</a>",,,,,,photograph,,,,,,,,"Please <a href=""https://howelllibrary.org/howell-area-archives/#archives-inquiry"">submit an inquiry</a> to the archives if you want a better quality digital image or a print. Include the title of the image and reason for print/digital image with your inquiry. Archives staff will contact you regarding your inquiry.",,"Howell Carnegie District Library makes no representation that it is the owner of the copyright in any published material. It is the responsibility of the researcher to obtain permission to publish from the owner of the copyright.","military,persian gulf war,veteran",https://archives.howelllibrary.org/files/original/dc44f940f3b7cb3f1079893812afb774.jpg,"Still Image",Military/Veterans,1,0
11961,https://archives.howelllibrary.org/items/show/11961,"Staff Sgt. Patrick Wright,  E6, US Army",,Veterans,"Copyright Undetermined",image/jpeg,Image,,,,,,"<a href=""https://archives.howelllibrary.org/exhibits/show/honoring-veterans-with-howell-"">Part of the Veterans Day Exhibit</a>",,,,,,photograph,,,,,,,,"Please <a href=""https://howelllibrary.org/howell-area-archives/#archives-inquiry"">submit an inquiry</a> to the archives if you want a better quality digital image or a print. Include the title of the image and reason for print/digital image with your inquiry. Archives staff will contact you regarding your inquiry.",,"Howell Carnegie District Library makes no representation that it is the owner of the copyright in any published material. It is the responsibility of the researcher to obtain permission to publish from the owner of the copyright.","army,military,veteran",https://archives.howelllibrary.org/files/original/75948404d9871f7cce44c52d03965538.jpg,"Still Image",Military/Veterans,1,0
11629,https://archives.howelllibrary.org/items/show/11629,"Staff Sgt. Lane N. Barton,  Air Cargo Pilot, US Army Air Corps, WWII",,Veterans,"Copyright Undetermined",image/jpeg,Image,1942/1946,,,,,"<a href=""https://archives.howelllibrary.org/exhibits/show/honoring-veterans-with-howell-"">Part of the Veterans Day Exhibit</a>",,,,,,photograph,,,,,,,,"Please <a href=""https://howelllibrary.org/howell-area-archives/#archives-inquiry"">submit an inquiry</a> to the archives if you want a better quality digital image or a print. Include the title of the image and reason for print/digital image with your inquiry. Archives staff will contact you regarding your inquiry.",,"Howell Carnegie District Library makes no representation that it is the owner of the copyright in any published material. It is the responsibility of the researcher to obtain permission to publish from the owner of the copyright.","army air corps,military,veteran,WWII",https://archives.howelllibrary.org/files/original/b4f9d81ba9f87169c6aeb9402af740e6.jpg,"Still Image",Military/Veterans,1,0
11868,https://archives.howelllibrary.org/items/show/11868,"Staff Sgt. Ken Niblock, USAF",,Veterans,"Copyright Undetermined",image/jpeg,Image,,,,,,"<a href=""https://archives.howelllibrary.org/exhibits/show/honoring-veterans-with-howell-"">Part of the Veterans Day Exhibit</a>",,,,,,photograph,,,,,,,,"Please <a href=""https://howelllibrary.org/howell-area-archives/#archives-inquiry"">submit an inquiry</a> to the archives if you want a better quality digital image or a print. Include the title of the image and reason for print/digital image with your inquiry. Archives staff will contact you regarding your inquiry.",,"Howell Carnegie District Library makes no representation that it is the owner of the copyright in any published material. It is the responsibility of the researcher to obtain permission to publish from the owner of the copyright.","air force,military,veteran","https://archives.howelllibrary.org/files/original/a68c77605e468bfad6ba29418f5a74f2.jpg,https://archives.howelllibrary.org/files/original/d49295cda410d18b559fcf6227e0adb2.jpg","Still Image",Military/Veterans,1,0
11947,https://archives.howelllibrary.org/items/show/11947,"Staff Sgt. Edward Walker,  USArmy",,Veterans,"Copyright Undetermined",image/jpeg,Image,,,,,,"<a href=""https://archives.howelllibrary.org/exhibits/show/honoring-veterans-with-howell-"">Part of the Veterans Day Exhibit</a>",,,,,,photograph,,,,,,,,"Please <a href=""https://howelllibrary.org/howell-area-archives/#archives-inquiry"">submit an inquiry</a> to the archives if you want a better quality digital image or a print. Include the title of the image and reason for print/digital image with your inquiry. Archives staff will contact you regarding your inquiry.",,"Howell Carnegie District Library makes no representation that it is the owner of the copyright in any published material. It is the responsibility of the researcher to obtain permission to publish from the owner of the copyright.","army,military,veteran",https://archives.howelllibrary.org/files/original/f8ad722e6f35fc571e8612a30aa24f4f.jpg,"Still Image",Military/Veterans,1,0
