﻿"Item Id","Item URI","Dublin Core:Title","Dublin Core:Description","Dublin Core:Subject","Dublin Core:Rights","Dublin Core:Format","Dublin Core:Type","Dublin Core:Date","Dublin Core:Source","Dublin Core:Creator","Dublin Core:Publisher","Dublin Core:Contributor","Dublin Core:Relation","Dublin Core:Language","Dublin Core:Identifier","Dublin Core:Coverage","Item Type Metadata:Text","Item Type Metadata:Transcription","Item Type Metadata:Original Format","Item Type Metadata:Physical Dimensions","Item Type Metadata:Duration","Item Type Metadata:Compression","Item Type Metadata:Producer","Item Type Metadata:Director","Item Type Metadata:Bit Rate/Frequency","Item Type Metadata:URL","Item Type Metadata:Note","Item Type Metadata:Hidden Search Text","Item Type Metadata:Rights Note",tags,file,itemType,collection,public,featured
10593,https://archives.howelllibrary.org/items/show/10593,"Chilson Depot, Ann Arbor Railroad, Chilson, Michigan","This is a photograph in front of the Chilson Depot, Ann Arbor Railroad, Chilson, Livingston, Michigan.<br /><br />The names of the people and date are unknown.","Railroad stations","No Copyright - United States",image/jpeg,Image,,,,,,,,,,,,"film negative",,,,,,,,"<span>Use the Windows Snipping Tool to capture the area of the document you want to save. If you want multiple pages printed please see staff to print the pages you want.</span><a href=""https://howelllibrary.org/technology/#print"" target=""_blank"" rel=""noreferrer noopener"">View the library's printing information.</a>",,"Howell Carnegie District Library makes no representation that it is the owner of the copyright in any published material. It is the responsibility of the researcher to obtain permission to publish from the owner of the copyright.","chilson,depot,railroad",https://archives.howelllibrary.org/files/original/ac0fd5c1068e188a45d1d3c1c4ebadd5.jpg,"Still Image","Photos - Places",1,0
10554,https://archives.howelllibrary.org/items/show/10554,"Ann Arbor Railroad Depot, Howell, Michigan","This is a photograph outside the Ann Arbor Railroad Depot, North Walnut Street,  Howell, Michigan","Railroad stations","Copyright Undetermined",image/jpeg,Image,,,,,,,,,,,,"film negative",,,,,,,,"<span>Use the Windows Snipping Tool to capture the area of the document you want to save. If you want multiple pages printed please see staff to print the pages you want.</span><a href=""https://howelllibrary.org/technology/#print"" target=""_blank"" rel=""noreferrer noopener"">View the library's printing information.</a>",,"Howell Carnegie District Library makes no representation that it is the owner of the copyright in any published material. It is the responsibility of the researcher to obtain permission to publish from the owner of the copyright.","depot,howell,railroad,train",https://archives.howelllibrary.org/files/original/dba65e7fa5b21b143f2751157f5892ac.jpg,"Still Image","Photos - Places",1,0
10552,https://archives.howelllibrary.org/items/show/10552,"Pere Marquette Railroad Depot, Howell, Michigan","This is a photograph of the Pere Marquette Railroad Depot, Howell, Michigan.<br /><br />The year is unknown.","Railroad stations","Copyright Undetermined",image/jpeg,Image,,,,,,,,,,,,"film negative",,,,,,,,"<span>Use the Windows Snipping Tool to capture the area of the document you want to save. If you want multiple pages printed please see staff to print the pages you want.</span><a href=""https://howelllibrary.org/technology/#print"" target=""_blank"" rel=""noreferrer noopener"">View the library's printing information.</a>",,"Howell Carnegie District Library makes no representation that it is the owner of the copyright in any published material. It is the responsibility of the researcher to obtain permission to publish from the owner of the copyright.","depot,howell,unknown",https://archives.howelllibrary.org/files/original/9744553099fc26e3ce588ec95ff0afb4.jpg,"Still Image","Photos - Places",1,0
10530,https://archives.howelllibrary.org/items/show/10530,"Ann Arbor Railroad Depot, Howell, Michigan","This is a photograph taken at the Ann Arbor Railroad Depot, Howell, Michigan.  ","Railroad stations","Copyright Undetermined",image/jpeg,Image,,,,,,,,,,,,"film negative",,,,,,,,"<span>Use the Windows Snipping Tool to capture the area of the document you want to save. If you want multiple pages printed please see staff to print the pages you want.</span><a href=""https://howelllibrary.org/technology/#print"" target=""_blank"" rel=""noreferrer noopener"">View the library's printing information.</a>",,"Howell Carnegie District Library makes no representation that it is the owner of the copyright in any published material. It is the responsibility of the researcher to obtain permission to publish from the owner of the copyright.","ann arbor,depot,howell,railroad",https://archives.howelllibrary.org/files/original/f99b93d73b4f366edc9adc36da8b845c.jpg,"Still Image","Photos - Places",1,0
10505,https://archives.howelllibrary.org/items/show/10505,"Ann Arbor Railroad Depot, Howell, Michigan","This is a photograph of the Ann Arbor Railroad Depot, Howell, Michigan.  The steam locomotive is traveling east/south on the track.  The year is unknown.","Railroad stations","Copyright Undetermined",image/jpeg,Image,,,,,,,,,,,,"film negative",,,,,,,,"<span>Use the Windows Snipping Tool to capture the area of the document you want to save. If you want multiple pages printed please see staff to print the pages you want.</span><a href=""https://howelllibrary.org/technology/#print"" target=""_blank"" rel=""noreferrer noopener"">View the library's printing information.</a>",,"Howell Carnegie District Library makes no representation that it is the owner of the copyright in any published material. It is the responsibility of the researcher to obtain permission to publish from the owner of the copyright.","ann arbor,depot,howell,train,unknown",https://archives.howelllibrary.org/files/original/8f022e8d3e55801afbd0d67223e68022.jpg,"Still Image","Photos - Places",1,0
10504,https://archives.howelllibrary.org/items/show/10504,"Pere Marquette Railroad Depot, Howell, Michigan","This is a photograph of the Pere Marquette Railroad Depot, Howell, Michigan.  The year and the names of the persons at the station are unknown.  Railroad cars are also noted in the picture.","Railroad stations","Copyright Undetermined",image/jpeg,Image,,,,,,,,,,,,"film negative",,,,,,,,"<span>Use the Windows Snipping Tool to capture the area of the document you want to save. If you want multiple pages printed please see staff to print the pages you want.</span><a href=""https://howelllibrary.org/technology/#print"" target=""_blank"" rel=""noreferrer noopener"">View the library's printing information.</a>",,"Howell Carnegie District Library makes no representation that it is the owner of the copyright in any published material. It is the responsibility of the researcher to obtain permission to publish from the owner of the copyright.","depot,howell,railroad,unknown",https://archives.howelllibrary.org/files/original/abc1a4e7b69091c69b1aee26782b84af.jpg,"Still Image","Photos - Places",1,0
10307,https://archives.howelllibrary.org/items/show/10307,"Train Arriving Pinckney Depot, Pinckney, Michigan","This is a photograph of a train arriving at the Pinckney Depot, Pinckney, Michigan.  The date is unknown.",Railroads,"Copyright Undetermined",image/jpeg,Image,,,,,,,,,,,,"glass negative",,,,,,,,"<span>Use the Windows Snipping Tool to capture the area of the document you want to save. If you want multiple pages printed please see staff to print the pages you want.</span><a href=""https://howelllibrary.org/technology/#print"" target=""_blank"" rel=""noreferrer noopener"">View the library's printing information.</a>",,"Howell Carnegie District Library makes no representation that it is the owner of the copyright in any published material. It is the responsibility of the researcher to obtain permission to publish from the owner of the copyright.","depot,pinckney,railroad,train,unknown",https://archives.howelllibrary.org/files/original/72de65612f261663d19b5a6f3e760495.jpg,"Still Image","Photos - Places",1,0
10149,https://archives.howelllibrary.org/items/show/10149,"Visit With the Station Master, Howell, Michigan - 2014","Duane Brown, station master tells the story of the historic train station in Howell, Michigan. (HCDL-bd-Visit-with-the-station-master_m.mp4)<br /><br /><span><strong>Names or Places mentioned in video:</strong><br /></span>Duane Brown, Ann Arbor Railroad, Ann Arbor Depot, Grand River Avenue","Railroad stations","Copyright Undetermined",video/mp4,"Moving Image",2014,,"<a href=""http://www.howellareahistoricalsociety.org/"" target=""_blank"" rel=""noreferrer noopener"">Howell Area Historical Society</a>",,,,,,,,,"digital video",,,,,,,,,,"Howell Carnegie District Library makes no representation that it is the owner of the copyright in any published material. It is the responsibility of the researcher to obtain permission to publish from the owner of the copyright.","depot,engineer,howell,railroad,telegraph",https://archives.howelllibrary.org/files/original/d641532d6a470375520ad1b3f2104ca4.jpg,"Moving Image",Videos,1,0
10111,https://archives.howelllibrary.org/items/show/10111,"Cohoctah Depot, Cohoctah, Michigan","<span>Cohoctah Depot, Cohoctah, Michigan<br />looking south<br />built in 1886 servicing the Ann Arbor Railway<br />unknown year of picture</span>","Railroad stations","Copyright Undetermined",image/jpeg,Image,,,,,,,,,,,,"film negative",,,,,,,,"<span>Please </span><a href=""https://howelllibrary.org/howell-area-archives/#archives-inquiry"">submit an inquiry</a><span> to the archives if you want a better quality digital image or a print. Include the title of the image and reason for print/digital image with your inquiry. Archives staff will contact you regarding your inquiry.</span>",,"Howell Carnegie District Library makes no representation that it is the owner of the copyright in any published material. It is the responsibility of the researcher to obtain permission to publish from the owner of the copyright.","cohoctah township,depot,railroad,unknown",https://archives.howelllibrary.org/files/original/040bc24d09a972223eac35d65eb0d21f.jpg,"Still Image","Photos - Places",1,0
10110,https://archives.howelllibrary.org/items/show/10110,"Cohoctah Depot, Cohoctah, Michigan","Cohoctah Depot, Cohoctah, Michigan<br /><br />unknown year and people","Railroad stations","Copyright Undetermined",image/jpeg,Image,,,,,,,,,,,,"film negative",,,,,,,,"<span>Please </span><a href=""https://howelllibrary.org/howell-area-archives/#archives-inquiry"">submit an inquiry</a><span> to the archives if you want a better quality digital image or a print. Include the title of the image and reason for print/digital image with your inquiry. Archives staff will contact you regarding your inquiry.</span>",,"Howell Carnegie District Library makes no representation that it is the owner of the copyright in any published material. It is the responsibility of the researcher to obtain permission to publish from the owner of the copyright.","cohoctah township,depot,railroad,unknown",https://archives.howelllibrary.org/files/original/161db8bbfce4831e0908a97cc9943fb6.jpg,"Still Image","Photos - Places",1,0
