﻿"Item Id","Item URI","Dublin Core:Title","Dublin Core:Description","Dublin Core:Subject","Dublin Core:Rights","Dublin Core:Format","Dublin Core:Type","Dublin Core:Date","Dublin Core:Source","Dublin Core:Creator","Dublin Core:Publisher","Dublin Core:Contributor","Dublin Core:Relation","Dublin Core:Language","Dublin Core:Identifier","Dublin Core:Coverage","Item Type Metadata:Text","Item Type Metadata:Transcription","Item Type Metadata:Original Format","Item Type Metadata:Physical Dimensions","Item Type Metadata:Duration","Item Type Metadata:Compression","Item Type Metadata:Producer","Item Type Metadata:Director","Item Type Metadata:Bit Rate/Frequency","Item Type Metadata:URL","Item Type Metadata:Note","Item Type Metadata:Hidden Search Text","Item Type Metadata:Rights Note",tags,file,itemType,collection,public,featured
10608,https://archives.howelllibrary.org/items/show/10608,"Rush Lake Float, Fourth of July Parade, Pinckney, Michigan, 1935","This is a photograph of the Rush Lake Float, Fourth of July Parade, Pinckney, Michigan, 1935.  The names of the persons on the float are unknown.",Parades,"Copyright Undetermined",image/jpeg,Image,1935-07-04,,,,,,,,,,,"film negative",,,,,,,,"<span>Use the Windows Snipping Tool to capture the area of the document you want to save. If you want multiple pages printed please see staff to print the pages you want.</span><a href=""https://howelllibrary.org/technology/#print"" target=""_blank"" rel=""noreferrer noopener"">View the library's printing information.</a>",,"Howell Carnegie District Library makes no representation that it is the owner of the copyright in any published material. It is the responsibility of the researcher to obtain permission to publish from the owner of the copyright.","fourth of july,parade,pinckney,rush lake,unknown",https://archives.howelllibrary.org/files/original/960fe0b37298e47920118b21ff72cdc6.jpg,"Still Image","Photos - Events",1,0
10607,https://archives.howelllibrary.org/items/show/10607,"Mobil Gas Float, Fourth of July Parade, Pinckney, Michigan, 1935","This is a photograph of the Mobil Gas Float, Fourth of July Parade, Pinckney, Michigan, 1935.  The names of the persons on the float are unknown.",Parades,"Copyright Undetermined",image/jpeg,Image,1935-07-04,,,,,,,,,,,"film negative",,,,,,,,"<span>Use the Windows Snipping Tool to capture the area of the document you want to save. If you want multiple pages printed please see staff to print the pages you want.</span><a href=""https://howelllibrary.org/technology/#print"" target=""_blank"" rel=""noreferrer noopener"">View the library's printing information.</a>",,"Howell Carnegie District Library makes no representation that it is the owner of the copyright in any published material. It is the responsibility of the researcher to obtain permission to publish from the owner of the copyright.","fourth of july,gasoline,parade,pinckney,unknown",https://archives.howelllibrary.org/files/original/e8d6eb56f69770c90a1c69c4758f2e8f.jpg,"Still Image","Photos - Events",1,0
10606,https://archives.howelllibrary.org/items/show/10606,"Stockbridge Float, Fourth of July Parade, Pinckney, Michigan, 1935","This is a photograph of the Stockbridge Float, Fourth of July Parade, Pinckney, Michigan, 1935.  ",Parades,"Copyright Undetermined",image/jpeg,Image,1935-07-04,,,,,,,,,,,"film negative",,,,,,,,"<span>Use the Windows Snipping Tool to capture the area of the document you want to save. If you want multiple pages printed please see staff to print the pages you want.</span><a href=""https://howelllibrary.org/technology/#print"" target=""_blank"" rel=""noreferrer noopener"">View the library's printing information.</a>",,"Howell Carnegie District Library makes no representation that it is the owner of the copyright in any published material. It is the responsibility of the researcher to obtain permission to publish from the owner of the copyright.","fourth of july,parade,pinckney,stockbridge",https://archives.howelllibrary.org/files/original/96bbf01cadcfd762fcac32667c3b4c71.jpg,"Still Image","Photos - Events",1,0
10562,https://archives.howelllibrary.org/items/show/10562,"Sigler &amp; Sigler Sanitarium, Pinckney, Michigan","This is a photograph of a postcard of Sigler &amp; Sigler Sanitarium, Pinckney, Michigan.<br /><br />The year of the photograph/postcard is unknown.",Hospitals,"Copyright Undetermined",image/jpeg,Image,,,,,,,,,,,,"film negative",,,,,,,,"<span>Use the Windows Snipping Tool to capture the area of the document you want to save. If you want multiple pages printed please see staff to print the pages you want.</span><a href=""https://howelllibrary.org/technology/#print"" target=""_blank"" rel=""noreferrer noopener"">View the library's printing information.</a>",,"Howell Carnegie District Library makes no representation that it is the owner of the copyright in any published material. It is the responsibility of the researcher to obtain permission to publish from the owner of the copyright.","hospital,pinckney,sanitarium",https://archives.howelllibrary.org/files/original/868e256ff33f3970a6f109350f7874a9.jpg,"Still Image","Photos - Places",1,0
10374,https://archives.howelllibrary.org/items/show/10374,"Unknown Persons, Pinckney, Michigan","This is a photograph of an unknown girl and woman in front of a store believed to be in Pinckney, Michigan.",Persons,"Copyright Undetermined",image/jpeg,Image,,,"Fred Teeple",,,,,,,,,"glass negative",,,,,,,,"<span>Use the Windows Snipping Tool to capture the area of the document you want to save. If you want multiple pages printed please see staff to print the pages you want.</span><a href=""https://howelllibrary.org/technology/#print"" target=""_blank"" rel=""noreferrer noopener"">View the library's printing information.</a>",,"Howell Carnegie District Library makes no representation that it is the owner of the copyright in any published material. It is the responsibility of the researcher to obtain permission to publish from the owner of the copyright.","pinckney,store,unknown",https://archives.howelllibrary.org/files/original/74cf0565a484c042f1a0c7717b3c53cc.jpg,"Still Image","Photos - People",1,0
10372,https://archives.howelllibrary.org/items/show/10372,"Unknown Boys, Pinckney, Michigan","This is a photograph of unknown boys sitting in front of a store believed to be in Pinckney, Michigan.",Persons,"Copyright Undetermined",image/jpeg,Image,,,"Fred Teeple",,,,,,,,,"glass negative",,,,,,,,"<span>Use the Windows Snipping Tool to capture the area of the document you want to save. If you want multiple pages printed please see staff to print the pages you want.</span><a href=""https://howelllibrary.org/technology/#print"" target=""_blank"" rel=""noreferrer noopener"">View the library's printing information.</a>",,"Howell Carnegie District Library makes no representation that it is the owner of the copyright in any published material. It is the responsibility of the researcher to obtain permission to publish from the owner of the copyright.","pinckney,store,unknown",https://archives.howelllibrary.org/files/original/3d18fcff720a04417026479954e249a2.jpg,"Still Image","Photos - People",1,0
10371,https://archives.howelllibrary.org/items/show/10371,"Thompson Grimes Monument, Pinckney Cemetery, Pinckney, Michigan","This is a photograph taken near the Grimes Monument at the Pinckney Cemetery, Pinckney, Michigan.<br />Thompson Grimes, born 1824, died 1897, is buried there with other family members.<br />The date of this photograph is unknown.",Cemeteries,"Copyright Undetermined",image/jpeg,Image,,,"Fred Teeple",,,,,,,,,"glass negative",,,,,,,,"<span>Use the Windows Snipping Tool to capture the area of the document you want to save. If you want multiple pages printed please see staff to print the pages you want.</span><a href=""https://howelllibrary.org/technology/#print"" target=""_blank"" rel=""noreferrer noopener"">View the library's printing information.</a>",,"Howell Carnegie District Library makes no representation that it is the owner of the copyright in any published material. It is the responsibility of the researcher to obtain permission to publish from the owner of the copyright.","cemetery,monument,pinckney,unknown",https://archives.howelllibrary.org/files/original/ddf64157754a0ac0ba6c2d172155ecf8.jpg,"Still Image","Photos - Places",1,0
10365,https://archives.howelllibrary.org/items/show/10365,"Unknown Men, Pinckney, Michigan","This is a photograph of two unknown men believed to be in front of a store in Pinckney, Michigan.",Persons,"Copyright Undetermined",image/jpeg,Image,,,"Fred Teeple",,,,,,,,,"glass negative",,,,,,,,"<span>Use the Windows Snipping Tool to capture the area of the document you want to save. If you want multiple pages printed please see staff to print the pages you want.</span><a href=""https://howelllibrary.org/technology/#print"" target=""_blank"" rel=""noreferrer noopener"">View the library's printing information.</a>",,"Howell Carnegie District Library makes no representation that it is the owner of the copyright in any published material. It is the responsibility of the researcher to obtain permission to publish from the owner of the copyright.","pinckney,store,unknown",https://archives.howelllibrary.org/files/original/c4a2c7ca32e4612eff40763c313ba88d.jpg,"Still Image","Photos - People",1,0
10363,https://archives.howelllibrary.org/items/show/10363,"Unknown Men, Pinckney, Michigan","This is a photograph of two unknown men standing in front of a store believed to be in Pinckney, Michigan.",Persons,"Copyright Undetermined",image/jpeg,Image,,,"Fred Teeple",,,,,,,,,"glass negative",,,,,,,,"<span>Use the Windows Snipping Tool to capture the area of the document you want to save. If you want multiple pages printed please see staff to print the pages you want.</span><a href=""https://howelllibrary.org/technology/#print"" target=""_blank"" rel=""noreferrer noopener"">View the library's printing information.</a>",,"Howell Carnegie District Library makes no representation that it is the owner of the copyright in any published material. It is the responsibility of the researcher to obtain permission to publish from the owner of the copyright.","pinckney,store,unknown",https://archives.howelllibrary.org/files/original/f7bb08e7177283f351c2c8b114da9df4.jpg,"Still Image","Photos - People",1,0
10362,https://archives.howelllibrary.org/items/show/10362,"Unknown Men, Dog, Pinckney, Michigan","This is a photograph and unknown men and a dog in front of a store believed to be in Pinckney, Michigan.",Persons,"Copyright Undetermined",image/jpeg,Image,,,"Fred Teeple",,,,,,,,,"glass negative",,,,,,,,"<span>Use the Windows Snipping Tool to capture the area of the document you want to save. If you want multiple pages printed please see staff to print the pages you want.</span><a href=""https://howelllibrary.org/technology/#print"" target=""_blank"" rel=""noreferrer noopener"">View the library's printing information.</a>",,"Howell Carnegie District Library makes no representation that it is the owner of the copyright in any published material. It is the responsibility of the researcher to obtain permission to publish from the owner of the copyright.","dog,pinckney,store,unknown",https://archives.howelllibrary.org/files/original/886ceecb7e72af231711ded7e100ff4e.jpg,"Still Image","Photos - People",1,0
